Target
Adenosine receptor A2a
Ligand
BDBM50120770
Substrate
Meas. Tech.
ChEMBL_30745 (CHEMBL649776)
Ki
>10000±n/a nM
Citation
 Novellino, EAbignente, ECosimelli, BGreco, GIadanza, MLaneri, SLavecchia, ARimoli, MGSettimo, FDPrimofiore, GTuscano, DTrincavelli, LMartini, C Design, synthesis and biological evaluation of novel N-alkyl- and N-acyl-(7-substituted-2-phenylimidazo[1,2-a][1,3,5]triazin-4-yl)amines (ITAs) as novel A(1) adenosine receptor antagonists. J Med Chem 45:5030-6 (2002)  
Target
Name:
Adenosine receptor A2a
Synonyms:
A2A adenosine receptor (hA2A) ADENOSINE A2 ADORA2 Adenosine A2A receptor (A2AAR)
Type:
G Protein-Coupled Receptor (GPCR)
Mol. Mass.:
44716.46
Organism:
Homo sapiens (Human)
Description:
P29274
Residue:
412
  
Inhibitor
Name:
BDBM50120770
Synonyms:
Adamantan-1-yl-(7-methyl-2-phenyl-imidazo[1,2-a][1,3,5]triazin-4-yl)-amine | CHEMBL145822
Type:
Small organic molecule
Emp. Form.:
C22H25N5
Mol. Mass.:
359.4674
SMILES:
Cc1cn2c(NC34C[C@H]5C[C@H](C[C@H](C5)C3)C4)nc(nc2n1)-c1ccccc1
: