Target
Neuropeptide FF receptor 2
Ligand
BDBM50558730
Substrate
Meas. Tech.
ChEMBL_2064490 (CHEMBL4719743)
EC50
185±n/a nM
Citation
 Wang, ZLPan, JXSong, JJTang, HHYu, HPLi, XHLi, NZhang, TZhang, RZhang, MNXu, BFang, QWang, R Structure-Based Optimization of Multifunctional Agonists for Opioid and Neuropeptide FF Receptors with Potent Nontolerance Forming Analgesic Activities. J Med Chem 59:10198-10208 (2016)  
Target
Name:
Neuropeptide FF receptor 2
Synonyms:
G-protein coupled receptor 74 GPR74 NPFF2_HUMAN NPGPR Neuropeptide G-protein coupled receptor
Type:
Enzyme Catalytic Domain
Mol. Mass.:
60293.78
Organism:
Homo sapiens (Human)
Description:
NPFF2 0 HUMAN::Q9Y5X5
Residue:
522
  
Inhibitor
Name:
BDBM50558730
Synonyms:
CHEMBL4792870
Type:
Small organic molecule
Emp. Form.:
C50H68N14O11
Mol. Mass.:
1041.1621
SMILES:
C[C@@H](NC(=O)[C@@H](N)Cc1ccc(O)cc1)C(=O)NCC(=O)N[C@@H](Cc1ccccc1)C(=O)NCC(=O)N1CCC[C@H]1C(=O)N[C@@H](CCC(N)=O)C(=O)N[C@@H](CCCNC(N)=N)C(=O)N[C@@H](Cc1ccccc1)C(N)=O
: