Target
Glucagon receptor
Ligand
BDBM50121046
Substrate
Meas. Tech.
ChEMBL_72863 (CHEMBL683959)
IC50
25±n/a nM
Citation
 Ladouceur, GHCook, JHHertzog, DLJones, JHHundertmark, TKorpusik, MLease, TGLivingston, JNMacDougall, MLOsterhout, MHPhelan, KRomero, RHSchoen, WRShao, CSmith, RA Integration of optimized substituent patterns to produce highly potent 4-aryl-pyridine glucagon receptor antagonists. Bioorg Med Chem Lett 12:3421-4 (2002)  
Target
Name:
Glucagon receptor
Synonyms:
GCGR GLR_HUMAN Glucagon receptor (GlucR)
Type:
Enzyme
Mol. Mass.:
54026.92
Organism:
Homo sapiens (Human)
Description:
P47871
Residue:
477
  
Inhibitor
Name:
BDBM50121046
Synonyms:
2-[3-(1-Hydroxy-ethyl)-2,6-diisopropyl-5-propyl-pyridin-4-yl]-phenol | CHEMBL116413
Type:
Small organic molecule
Emp. Form.:
C22H31NO2
Mol. Mass.:
341.487
SMILES:
CCCc1c(nc(C(C)C)c(C(C)O)c1-c1ccccc1O)C(C)C
: