Target
Glucagon receptor
Ligand
BDBM50121045
Substrate
Meas. Tech.
ChEMBL_72859 (CHEMBL878574)
IC50
20±n/a nM
Citation
 Ladouceur, GHCook, JHHertzog, DLJones, JHHundertmark, TKorpusik, MLease, TGLivingston, JNMacDougall, MLOsterhout, MHPhelan, KRomero, RHSchoen, WRShao, CSmith, RA Integration of optimized substituent patterns to produce highly potent 4-aryl-pyridine glucagon receptor antagonists. Bioorg Med Chem Lett 12:3421-4 (2002)  
Target
Name:
Glucagon receptor
Synonyms:
GCGR GLR_HUMAN Glucagon receptor (GlucR)
Type:
Enzyme
Mol. Mass.:
54026.92
Organism:
Homo sapiens (Human)
Description:
P47871
Residue:
477
  
Inhibitor
Name:
BDBM50121045
Synonyms:
2-[3-Ethyl-5-(1-hydroxy-ethyl)-2,6-diisopropyl-pyridin-4-yl]-5-fluoro-phenol | CHEMBL114762
Type:
Small organic molecule
Emp. Form.:
C21H28FNO2
Mol. Mass.:
345.4509
SMILES:
CCc1c(nc(C(C)C)c(C(C)O)c1-c1ccc(F)cc1O)C(C)C
: