Target
Glucagon receptor
Ligand
BDBM50121047
Substrate
Meas. Tech.
ChEMBL_72863 (CHEMBL683959)
IC50
10±n/a nM
Citation
 Ladouceur, GHCook, JHHertzog, DLJones, JHHundertmark, TKorpusik, MLease, TGLivingston, JNMacDougall, MLOsterhout, MHPhelan, KRomero, RHSchoen, WRShao, CSmith, RA Integration of optimized substituent patterns to produce highly potent 4-aryl-pyridine glucagon receptor antagonists. Bioorg Med Chem Lett 12:3421-4 (2002)  
Target
Name:
Glucagon receptor
Synonyms:
GCGR GLR_HUMAN Glucagon receptor (GlucR)
Type:
Enzyme
Mol. Mass.:
54026.92
Organism:
Homo sapiens (Human)
Description:
P47871
Residue:
477
  
Inhibitor
Name:
BDBM50121047
Synonyms:
5-Fluoro-2-[3-(1-hydroxy-ethyl)-2,6-diisopropyl-5-propyl-pyridin-4-yl]-phenol | CHEMBL323913
Type:
Small organic molecule
Emp. Form.:
C22H30FNO2
Mol. Mass.:
359.4775
SMILES:
CCCc1c(nc(C(C)C)c(C(C)O)c1-c1ccc(F)cc1O)C(C)C
: