Target
Gonadotropin-releasing hormone receptor
Ligand
BDBM50121087
Substrate
Meas. Tech.
ChEBML_71749
Ki
865±n/a nM
Citation
 Luthin, DRHong, YPathak, VPPaderes, GNared-Hood, KDCastro, MAVazir, HLi, HTompkins, EChristie, LMay, JMAnderson, MB The discovery of novel small molecule non-peptide gonadotropin releasing hormone (GnRH) receptor antagonists. Bioorg Med Chem Lett 12:3467-70 (2002)  
Target
Name:
Gonadotropin-releasing hormone receptor
Synonyms:
GNRHR_RAT GnRH-R | Gnrhr
Type:
PROTEIN
Mol. Mass.:
37767.60
Organism:
Rattus norvegicus
Description:
ChEMBL_1335047
Residue:
327
  
Inhibitor
Name:
BDBM50121087
Synonyms:
5-(3,5,5,8,8-Pentamethyl-5,6,7,8-tetrahydro-naphthalen-2-ylmethyl)-furan-2-carboxylic acid (4-{[(2,6-dioxo-1,2,3,6-tetrahydro-pyrimidin-4-ylmethyl)-amino]-methyl}-cyclohexylmethyl)-amide | CHEMBL325747
Type:
Small organic molecule
Emp. Form.:
C34H46N4O4
Mol. Mass.:
574.7534
SMILES:
Cc1cc2c(cc1Cc1ccc(o1)C(=O)NCC1CCC(CNCc3cc(=O)[nH]c(=O)[nH]3)CC1)C(C)(C)CCC2(C)C
: