Target
Gonadotropin-releasing hormone receptor
Ligand
BDBM50121085
Substrate
Meas. Tech.
ChEBML_71749
Ki
2730±n/a nM
Citation
 Luthin, DRHong, YPathak, VPPaderes, GNared-Hood, KDCastro, MAVazir, HLi, HTompkins, EChristie, LMay, JMAnderson, MB The discovery of novel small molecule non-peptide gonadotropin releasing hormone (GnRH) receptor antagonists. Bioorg Med Chem Lett 12:3467-70 (2002)  
Target
Name:
Gonadotropin-releasing hormone receptor
Synonyms:
GNRHR_RAT GnRH-R | Gnrhr
Type:
PROTEIN
Mol. Mass.:
37767.60
Organism:
Rattus norvegicus
Description:
ChEMBL_1335047
Residue:
327
  
Inhibitor
Name:
BDBM50121085
Synonyms:
4-({[5-(3,5,5,8,8-Pentamethyl-5,6,7,8-tetrahydro-naphthalen-2-ylmethyl)-furan-2-carbonyl]-amino}-methyl)-cyclohexanecarboxylic acid ethyl ester | CHEMBL325843
Type:
Small organic molecule
Emp. Form.:
C31H43NO4
Mol. Mass.:
493.6774
SMILES:
CCOC(=O)[C@H]1CC[C@H](CNC(=O)c2ccc(Cc3cc4c(cc3C)C(C)(C)CCC4(C)C)o2)CC1
: