Target
Gonadotropin-releasing hormone receptor
Ligand
BDBM50121084
Substrate
Meas. Tech.
ChEBML_71598
Ki
180±n/a nM
Citation
 Luthin, DRHong, YPathak, VPPaderes, GNared-Hood, KDCastro, MAVazir, HLi, HTompkins, EChristie, LMay, JMAnderson, MB The discovery of novel small molecule non-peptide gonadotropin releasing hormone (GnRH) receptor antagonists. Bioorg Med Chem Lett 12:3467-70 (2002)  
Target
Name:
Gonadotropin-releasing hormone receptor
Synonyms:
GNRHR GRHR GnRH-R Gonadotropin-releasing hormone receptor | Gonadotropin-releasing hormone receptor (GnRH)
Type:
Enzyme
Mol. Mass.:
37749.45
Organism:
Homo sapiens (Human)
Description:
P30968
Residue:
328
  
Inhibitor
Name:
BDBM50121084
Synonyms:
5-(3,5,5,8,8-Pentamethyl-5,6,7,8-tetrahydro-naphthalen-2-ylmethyl)-furan-2-carboxylic acid (4-{[(3,5-dimethyl-isoxazol-4-ylmethyl)-amino]-methyl}-cyclohexylmethyl)-amide | CHEMBL324394
Type:
Small organic molecule
Emp. Form.:
C35H49N3O3
Mol. Mass.:
559.7819
SMILES:
Cc1noc(C)c1CNCC1CCC(CNC(=O)c2ccc(Cc3cc4c(cc3C)C(C)(C)CCC4(C)C)o2)CC1
: