Target
Tyrosine-protein kinase FRK
Ligand
BDBM50322535
Substrate
Meas. Tech.
ChEMBL_2066528 (CHEMBL4721781)
IC50
1.3±n/a nM
Citation
 Dart, MLMachleidt, TJost, ESchwinn, MKRobers, MBShi, CKirkland, TAKilloran, MPWilkinson, JMHartnett, JRZimmerman, KWood, KV Homogeneous Assay for Target Engagement Utilizing Bioluminescent Thermal Shift. ACS Med Chem Lett 9:546-551 (2018)  
Target
Name:
Tyrosine-protein kinase FRK
Synonyms:
FRK FYN-related kinase PTK5 SRC | Tyrosine Kinase FRK
Type:
Tyrosine-protein kinase
Mol. Mass.:
58254.41
Organism:
Homo sapiens (Human)
Description:
P42685
Residue:
505
  
Inhibitor
Name:
BDBM50322535
Synonyms:
3-(imidazo[1,2-b]pyridazin-3-ylethynyl)-4-methyl-N-{4-[(4-methylpiperazin-1-yl)methyl]-3-(trifluoromethyl)phenyl}benzamide CHEMBL1171837 US10464902, Ponatinib | US9255107, AP24534
Type:
Small organic molecule
Emp. Form.:
C29H27F3N6O
Mol. Mass.:
532.5595
SMILES:
CN1CCN(Cc2ccc(NC(=O)c3ccc(C)c(c3)C#Cc3cnc4cccnn34)cc2C(F)(F)F)CC1
: