Target
Macrophage migration inhibitory factor
Ligand
BDBM50553885
Substrate
Meas. Tech.
ChEMBL_2067376 (CHEMBL4722629)
Kd
3630±n/a nM
Citation
 Xiao, ZFokkens, MChen, DKok, TProietti, Gvan Merkerk, RPoelarends, GJDekker, FJ Structure-activity relationships for binding of 4-substituted triazole-phenols to macrophage migration inhibitory factor (MIF). Eur J Med Chem 186:0 (2020)  
Target
Name:
Macrophage migration inhibitory factor
Synonyms:
GIF Glycosylation-inhibiting factor L-dopachrome tautomerase MIF/CD74 (Macrophage migration inhibitory factor and HLA-DR antigens-associated invariant chain) MMIF Macrophage migration inhibitory factor (MIF) | Phenylpyruvate tautomerase
Type:
Enzyme
Mol. Mass.:
12478.18
Organism:
Homo sapiens (Human)
Description:
P14174
Residue:
115
  
Inhibitor
Name:
BDBM50553885
Synonyms:
CHEMBL4745151
Type:
Small organic molecule
Emp. Form.:
C18H14FN5O2
Mol. Mass.:
351.3345
SMILES:
Oc1ccc(cc1F)-n1cc(CNC(=O)c2cc3ccccc3[nH]2)nn1
: