Target
Peroxisome proliferator-activated receptor gamma
Ligand
BDBM50121417
Substrate
Meas. Tech.
ChEMBL_42432 (CHEMBL883269)
EC50
600±n/a nM
Citation
 Thor, MBeierlein, KDykes, GGustavsson, ALHeidrich, JJendeberg, LLindqvist, BPegurier, CRoussel, PSlater, MSvensson, SSydow-Bäckman, MThornström, UUppenberg, J Synthesis and pharmacological evaluation of a new class of peroxisome proliferator-activated receptor modulators. Bioorg Med Chem Lett 12:3565-7 (2002)  
Target
Name:
Peroxisome proliferator-activated receptor gamma
Synonyms:
NR1C3 PPAR-gamma PPARG_HUMAN Peroxisome proliferator-activated receptor gamma (PPAR gamma) Peroxisome proliferator-activated receptor gamma (PPARĪ³) peroxisome proliferator-activated receptor gamma isoform 2
Type:
Nuclear Receptor
Mol. Mass.:
57613.46
Organism:
Homo sapiens (Human)
Description:
P37231
Residue:
505
  
Inhibitor
Name:
BDBM50121417
Synonyms:
CHEMBL119646 | Lithium; 2-(2,4-dichloro-benzoylamino)-5-(2-methylsulfanyl-ethoxy)-benzoate
Type:
Small organic molecule
Emp. Form.:
C17H14Cl2NO4S
Mol. Mass.:
399.269
SMILES:
CSCCOc1ccc(NC(=O)c2ccc(Cl)cc2Cl)c(c1)C([O-])=O
: