Target
Cathepsin S
Ligand
BDBM50121554
Substrate
Meas. Tech.
ChEMBL_48672 (CHEMBL658343)
IC50
6±n/a nM
Citation
 Ward, YDThomson, DSFrye, LLCywin, CLMorwick, TEmmanuel, MJZindell, RMcNeil, DBekkali, YGirardot, MHrapchak, MDeTuri, MCrane, KWhite, DPav, SWang, YHao, MHGrygon, CALabadia, MEFreeman, DMDavidson, WHopkins, JLBrown, MLSpero, DMGiradot, M Design and synthesis of dipeptide nitriles as reversible and potent Cathepsin S inhibitors. J Med Chem 45:5471-82 (2002)  
Target
Name:
Cathepsin S
Synonyms:
CATS_HUMAN Cathepsin S (Cat S) | cathepsin S preproprotein
Type:
Protein
Mol. Mass.:
37507.38
Organism:
Homo sapiens (Human)
Description:
P25774
Residue:
331
  
Inhibitor
Name:
BDBM50121554
Synonyms:
CHEMBL356155 | N-{1-[(Benzyloxymethyl-cyano-methyl)-carbamoyl]-2-cyclohexyl-ethyl}-isonicotinamide
Type:
Small organic molecule
Emp. Form.:
C25H30N4O3
Mol. Mass.:
434.5307
SMILES:
O=C(N[C@@H](COCc1ccccc1)C#N)[C@H](CC1CCCCC1)NC(=O)c1ccncc1
: