Target
Cathepsin S
Ligand
BDBM50121562
Substrate
Meas. Tech.
ChEMBL_48674 (CHEMBL658345)
Kd
0.8±n/a nM
Citation
 Ward, YDThomson, DSFrye, LLCywin, CLMorwick, TEmmanuel, MJZindell, RMcNeil, DBekkali, YGirardot, MHrapchak, MDeTuri, MCrane, KWhite, DPav, SWang, YHao, MHGrygon, CALabadia, MEFreeman, DMDavidson, WHopkins, JLBrown, MLSpero, DMGiradot, M Design and synthesis of dipeptide nitriles as reversible and potent Cathepsin S inhibitors. J Med Chem 45:5471-82 (2002)  
Target
Name:
Cathepsin S
Synonyms:
CATS_HUMAN Cathepsin S (Cat S) | cathepsin S preproprotein
Type:
Protein
Mol. Mass.:
37507.38
Organism:
Homo sapiens (Human)
Description:
P25774
Residue:
331
  
Inhibitor
Name:
BDBM50121562
Synonyms:
CHEMBL153239 | Morpholine-4-carboxylic acid [1-(1-cyano-3-phenyl-propylcarbamoyl)-2-cyclohexyl-ethyl]-amide
Type:
Small organic molecule
Emp. Form.:
C24H34N4O3
Mol. Mass.:
426.5518
SMILES:
O=C(N[C@@H](CCc1ccccc1)C#N)[C@H](CC1CCCCC1)NC(=O)N1CCOCC1
: