Target
Cathepsin S
Ligand
BDBM50121564
Substrate
Meas. Tech.
ChEMBL_48672 (CHEMBL658343)
IC50
47±n/a nM
Citation
 Ward, YDThomson, DSFrye, LLCywin, CLMorwick, TEmmanuel, MJZindell, RMcNeil, DBekkali, YGirardot, MHrapchak, MDeTuri, MCrane, KWhite, DPav, SWang, YHao, MHGrygon, CALabadia, MEFreeman, DMDavidson, WHopkins, JLBrown, MLSpero, DMGiradot, M Design and synthesis of dipeptide nitriles as reversible and potent Cathepsin S inhibitors. J Med Chem 45:5471-82 (2002)  
Target
Name:
Cathepsin S
Synonyms:
CATS_HUMAN Cathepsin S (Cat S) | cathepsin S preproprotein
Type:
Protein
Mol. Mass.:
37507.38
Organism:
Homo sapiens (Human)
Description:
P25774
Residue:
331
  
Inhibitor
Name:
BDBM50121564
Synonyms:
CHEMBL153678 | Morpholine-4-carboxylic acid [1-(1-cyano-3-phenyl-propylcarbamoyl)-3-methyl-butyl]-amide
Type:
Small organic molecule
Emp. Form.:
C21H30N4O3
Mol. Mass.:
386.4879
SMILES:
CC(C)C[C@H](NC(=O)N1CCOCC1)C(=O)N[C@@H](CCc1ccccc1)C#N
: