Target
Cathepsin S
Ligand
BDBM50121549
Substrate
Meas. Tech.
ChEMBL_48674 (CHEMBL658345)
Kd
0.4±n/a nM
Citation
 Ward, YDThomson, DSFrye, LLCywin, CLMorwick, TEmmanuel, MJZindell, RMcNeil, DBekkali, YGirardot, MHrapchak, MDeTuri, MCrane, KWhite, DPav, SWang, YHao, MHGrygon, CALabadia, MEFreeman, DMDavidson, WHopkins, JLBrown, MLSpero, DMGiradot, M Design and synthesis of dipeptide nitriles as reversible and potent Cathepsin S inhibitors. J Med Chem 45:5471-82 (2002)  
Target
Name:
Cathepsin S
Synonyms:
CATS_HUMAN Cathepsin S (Cat S) | cathepsin S preproprotein
Type:
Protein
Mol. Mass.:
37507.38
Organism:
Homo sapiens (Human)
Description:
P25774
Residue:
331
  
Inhibitor
Name:
BDBM50121549
Synonyms:
CHEMBL347111 N-((S)-1-((R)-2-(benzyloxy)-1-cyanoethylamino)-3-cyclohexyl-1-oxopropan-2-yl)morpholine-4-carboxamide
Type:
Small organic molecule
Emp. Form.:
C24H34N4O4
Mol. Mass.:
442.5512
SMILES:
O=C(N[C@@H](COCc1ccccc1)C#N)[C@H](CC1CCCCC1)NC(=O)N1CCOCC1
: