Target
Dual specificity mitogen-activated protein kinase kinase 4
Ligand
BDBM50559799
Substrate
Meas. Tech.
ChEMBL_2070429 (CHEMBL4725963)
IC50
190±n/a nM
Citation
 Kwong, AJScheidt, KA Non-'classical' MEKs: A review of MEK3-7 inhibitors. Bioorg Med Chem Lett 30:0 (2020)  
Target
Name:
Dual specificity mitogen-activated protein kinase kinase 4
Synonyms:
JNK-activating kinase 1 JNKK1 MAP2K4 MKK4 PRKMK4 SEK1 SKK1 | c-Jun N-terminal kinase kinase 1
Type:
PROTEIN
Mol. Mass.:
44294.29
Organism:
Homo sapiens (Human)
Description:
ChEMBL_1460558
Residue:
399
  
Inhibitor
Name:
BDBM50559799
Synonyms:
CHEMBL4748767
Type:
Small organic molecule
Emp. Form.:
C14H10N2O2
Mol. Mass.:
238.2414
SMILES:
OC(=O)c1ccc(cc1)-c1n[nH]c2ccccc12
: