Target
Retinoic acid receptor beta
Ligand
BDBM50122348
Substrate
Meas. Tech.
ChEMBL_195477 (CHEMBL798154)
EC50
139±n/a nM
Citation
 Farmer, LJZhi, LJeong, SLamph, WWOsburn, DLCroston, GFlatten, KSHeyman, RANadzan, AM Retinoic acid receptor ligands based on the 6-cyclopropyl-2,4-hexadienoic acid. Bioorg Med Chem Lett 13:261-4 (2002)  
Target
Name:
Retinoic acid receptor beta
Synonyms:
HAP NR1B2 RAR-beta RARB Retinoic acid receptor RXR-alpha/Retinoic acid receptor beta Retinoid receptor
Type:
PROTEIN
Mol. Mass.:
50498.70
Organism:
Homo sapiens (Human)
Description:
ChEMBL_1458015
Residue:
455
  
Inhibitor
Name:
BDBM50122348
Synonyms:
(2E,4E)-6-[1-(3,5-Di-tert-butyl-phenyl)-cyclopropyl]-3-methyl-hexa-2,4-dienoic acid | CHEMBL89581
Type:
Small organic molecule
Emp. Form.:
C24H34O2
Mol. Mass.:
354.5256
SMILES:
C\C(\C=C\CC1(CC1)c1cc(cc(c1)C(C)(C)C)C(C)(C)C)=C/C(O)=O
: