Target
cGMP-specific 3',5'-cyclic phosphodiesterase
Ligand
BDBM50036631
Substrate
Meas. Tech.
ChEMBL_2070956 (CHEMBL4726490)
IC50
6600±n/a nM
Citation
 Shaaban, MAElshaier, YAMMHammad, AHFarag, NAHassan Haredy, HAbdEl-Ghany, AAMohamed, KO Design and synthesis of pyrazolo[3,4-d]pyrimidinone derivatives: Discovery of selective phosphodiesterase-5 inhibitors. Bioorg Med Chem Lett 30:0 (2020)  
Target
Name:
cGMP-specific 3',5'-cyclic phosphodiesterase
Synonyms:
3',5'-cyclic phosphodiesterase PDE5 PDE5A_HUMAN Phosphodiesterase 5 (PDE5) Phosphodiesterase 5A (PDE5A) cGMP-specific 3',5'-cyclic phosphodiesterase
Type:
Protein
Mol. Mass.:
99975.83
Organism:
Homo sapiens (Human)
Description:
O76074
Residue:
875
  
Inhibitor
Name:
BDBM50036631
Synonyms:
CHEMBL3352836
Type:
Small organic molecule
Emp. Form.:
C21H28ClN5O4
Mol. Mass.:
449.931
SMILES:
COc1ccc(CNc2nc(ncc2C(=O)NCCCO)N2CCC[C@H]2CO)cc1Cl
: