Target
ATPase family AAA domain-containing protein 2
Ligand
BDBM50464128
Substrate
Meas. Tech.
ChEMBL_2071503 (CHEMBL4727037)
IC50
50±n/a nM
Citation
 Watson, RJBamborough, PBarnett, HChung, CWDavis, RGordon, LGrandi, PPetretich, MPhillipou, APrinjha, RKRioja, ISoden, PWerner, TDemont, EH GSK789: A Selective Inhibitor of the First Bromodomains (BD1) of the Bromo and Extra Terminal Domain (BET) Proteins. J Med Chem 63:9045-9069 (2020)  
Target
Name:
ATPase family AAA domain-containing protein 2
Synonyms:
AAA nuclear coregulator cancer-associated protein ATAD2 PRO2000
Type:
PROTEIN
Mol. Mass.:
158546.30
Organism:
Homo sapiens (Human)
Description:
ChEMBL_1500426
Residue:
1390
  
Inhibitor
Name:
BDBM50464128
Synonyms:
CHEMBL4206758
Type:
Small organic molecule
Emp. Form.:
C28H35F2N5O3
Mol. Mass.:
527.606
SMILES:
CO[C@H]1CNC[C@@H](OCC2CCC(F)(F)CC2)[C@@H]1Nc1ncc(-c2cncc(C)c2)c2cc(C)c(=O)[nH]c12
: