Target
Vasopressin V2 receptor
Ligand
BDBM50122716
Substrate
Meas. Tech.
ChEMBL_215029 (CHEMBL820880)
IC50
11000±n/a nM
Citation
 Hinschberger, AButt, SLelong, VBoulouard, MDumuis, ADauphin, FBureau, RPfeiffer, BRenard, PRault, S New benzo[h][1,6]naphthyridine and azepino[3,2-c]quinoline derivatives as selective antagonists of 5-HT4 receptors: binding profile and pharmacological characterization. J Med Chem 46:138-47 (2002)  
Target
Name:
Vasopressin V2 receptor
Synonyms:
AVPR2 | V2R_PIG
Type:
PROTEIN
Mol. Mass.:
40556.17
Organism:
Sus scrofa
Description:
ChEMBL_214870
Residue:
370
  
Inhibitor
Name:
BDBM50122716
Synonyms:
5-(Piperidin-4-ylmethoxy)-9-propyl-1,2,3,4-tetrahydro-benzo[h][1,6]naphthyridine | CHEMBL35226
Type:
Small organic molecule
Emp. Form.:
C21H29N3O
Mol. Mass.:
339.4745
SMILES:
CCCN1CCC(COc2nc3ccccc3c3NCCCc23)CC1
: