Target
Metabotropic glutamate receptor 1
Ligand
BDBM50122758
Substrate
Meas. Tech.
ChEMBL_105881 (CHEMBL717932)
IC50
>100000±n/a nM
Citation
 Cosford, NDTehrani, LRoppe, JSchweiger, ESmith, NDAnderson, JBristow, LBrodkin, JJiang, XMcDonald, IRao, SWashburn, MVarney, MA 3-[(2-Methyl-1,3-thiazol-4-yl)ethynyl]-pyridine: a potent and highly selective metabotropic glutamate subtype 5 receptor antagonist with anxiolytic activity. J Med Chem 46:204-6 (2003)  
Target
Name:
Metabotropic glutamate receptor 1
Synonyms:
GPRC1A GRM1_HUMAN Metabotropic Glutamate 1a | metabotropic glutamate 1
Type:
Enzyme
Mol. Mass.:
132358.19
Organism:
Homo sapiens (Human)
Description:
Q13255
Residue:
1194
  
Inhibitor
Name:
BDBM50122758
Synonyms:
2-methyl-4-(pyridin-3-ylethynyl)thiazole 3-(2-Methyl-thiazol-4-ylethynyl)-pyridine 3-[(2-methyl-4-thiazolyl)ethynyl]pyridine MTEP
Type:
Small organic molecule
Emp. Form.:
C11H8N2S
Mol. Mass.:
200.26
SMILES:
Cc1nc(cs1)C#Cc1cccnc1
: