Target
Protein kinase C alpha type
Ligand
BDBM50122944
Substrate
Meas. Tech.
ChEMBL_160297 (CHEMBL769625)
Ki
16±n/a nM
Citation
 Kozikowski, APNowak, IPetukhov, PAEtcheberrigaray, RMohamed, ATan, MLewin, NHennings, HPearce, LLBlumberg, PM New amide-bearing benzolactam-based protein kinase C modulators induce enhanced secretion of the amyloid precursor protein metabolite sAPPalpha. J Med Chem 46:364-73 (2003)  
Target
Name:
Protein kinase C alpha type
Synonyms:
KPCA_HUMAN PKC alpha and beta-2 PKC-alpha PRKACA Protein Kinase C- alpha Protein kinase C alpha (PKCa) Protein kinase C alpha type (PRKCA) RAF proto-oncogene serine/threonine-protein kinase
Type:
Enzyme
Mol. Mass.:
76755.65
Organism:
Homo sapiens (Human)
Description:
The recombinant human PKC enzymes were produced using a baculovirus expression system in SF9 cells
Residue:
672
  
Inhibitor
Name:
BDBM50122944
Synonyms:
5-Phenyl-penta-2,4-dienoic acid (5-hydroxymethyl-2-isopropyl-1-methyl-3-oxo-1,2,3,4,5,6-hexahydro-benzo[e][1,4]diazocin-8-yl)-amide | CHEMBL333240
Type:
Small organic molecule
Emp. Form.:
C26H31N3O3
Mol. Mass.:
433.5426
SMILES:
CC(C)[C@@H]1N(C)c2ccc(NC(=O)\C=C\C=C\c3ccccc3)cc2C[C@@H](CO)NC1=O
: