Target
Bone morphogenetic protein receptor type-2
Ligand
BDBM50560466
Substrate
Meas. Tech.
ChEMBL_2072225 (CHEMBL4727759)
IC50
>1000±n/a nM
Citation
 Engers, DWBollinger, SRFelts, ASVadukoot, AKWilliams, CHBlobaum, ALLindsley, CWHong, CCHopkins, CR Discovery, synthesis and characterization of a series of 7-aryl-imidazo[1,2-a]pyridine-3-ylquinolines as activin-like kinase (ALK) inhibitors. Bioorg Med Chem Lett 30:0 (2020)  
Target
Name:
Bone morphogenetic protein receptor type-2
Synonyms:
BMPR2 Bone Morphogenetic Protein Receptor type II (BMPR2) PPH1
Type:
PROTEIN
Mol. Mass.:
115194.11
Organism:
Homo sapiens (Human)
Description:
ChEMBL_774306
Residue:
1038
  
Inhibitor
Name:
BDBM50560466
Synonyms:
CHEMBL4740381
Type:
Small organic molecule
Emp. Form.:
C27H25N5
Mol. Mass.:
419.5209
SMILES:
Cc1cc(-c2cnc3cc(ccn23)-c2ccc(cc2)N2CCNCC2)c2ccccc2n1
: