Target
Sodium-dependent serotonin transporter
Ligand
BDBM50123074
Substrate
Meas. Tech.
ChEBML_201994
Ki
1.3±n/a nM
Citation
 van Hes, RSmid, PStroomer, CNTipker, KTulp, MTvan der Heyden, JAMcCreary, ACHesselink, MBKruse, CG SLV310, a novel, potential antipsychotic, combining potent dopamine D2 receptor antagonism with serotonin reuptake inhibition. Bioorg Med Chem Lett 13:405-8 (2003)  
Target
Name:
Sodium-dependent serotonin transporter
Synonyms:
5-HT Transporter 5HT transporter Anandamid membrane transporter, AMT Monoamine transporters; Norepinephrine & serotonin Slc6a4 Sodium-dependent serotonin transporter (SERT) | imipramine receptor
Type:
Multi-pass membrane protein
Mol. Mass.:
70168.43
Organism:
Rattus norvegicus (rat)
Description:
P31652
Residue:
630
  
Inhibitor
Name:
BDBM50123074
Synonyms:
2-{5-[4-(7-Methyl-1H-indol-3-yl)-3,6-dihydro-2H-pyridin-1-yl]-pentyl}-isoindole-1,3-dione | CHEMBL422618
Type:
Small organic molecule
Emp. Form.:
C27H29N3O2
Mol. Mass.:
427.5381
SMILES:
Cc1cccc2c(c[nH]c12)C1=CCN(CCCCCN2C(=O)c3ccccc3C2=O)CC1
: