Target
Homeodomain-interacting protein kinase 3
Ligand
BDBM50560704
Substrate
Meas. Tech.
ChEMBL_2072777 (CHEMBL4728311)
IC50
159±n/a nM
Citation
 Schröder, MBullock, ANFedorov, OBracher, FChaikuad, AKnapp, S DFG-1 Residue Controls Inhibitor Binding Mode and Affinity, Providing a Basis for Rational Design of Kinase Inhibitor Selectivity. J Med Chem 63:10224-10234 (2020)  
Target
Name:
Homeodomain-interacting protein kinase 3
Synonyms:
DYRK6 HIPK3 PKY
Type:
PROTEIN
Mol. Mass.:
133763.81
Organism:
Homo sapiens (Human)
Description:
ChEMBL_774503
Residue:
1215
  
Inhibitor
Name:
BDBM50560704
Synonyms:
CHEMBL4754195
Type:
Small organic molecule
Emp. Form.:
C22H16N4O
Mol. Mass.:
352.3886
SMILES:
Cn1cc(cn1)-c1ccc2occ(-c3cccc(c3)-c3ccncc3)c2n1
: