Target
Estrogen receptor
Ligand
BDBM50123208
Substrate
Meas. Tech.
ChEBML_67033
IC50
19±n/a nM
Citation
 Blizzard, TAMorgan, JDMosley, RTBirzin, ETFrisch, KRohrer, SPHammond, ML 2-Phenylspiroindenes: a novel class of selective estrogen receptor modulators (SERMs). Bioorg Med Chem Lett 13:479-83 (2003)  
Target
Name:
Estrogen receptor
Synonyms:
ER ESR ESR1_HUMAN Estrogen receptor Estrogen receptor (ER-alpha) Estrogen receptor alpha (ER) Nuclear receptor subfamily 3 group A member 1
Type:
Protein
Mol. Mass.:
66230.44
Organism:
Homo sapiens (Human)
Description:
P03372
Residue:
595
  
Inhibitor
Name:
BDBM50123208
Synonyms:
2-(4-hydroxyphenyl)-3-methyl-1,2'-spirobi[1H-indene]-5-ol | CHEMBL145576
Type:
Small organic molecule
Emp. Form.:
C24H20O2
Mol. Mass.:
340.4144
SMILES:
CC1=C(c2ccc(O)cc2)C2(Cc3ccccc3C2)c2ccc(O)cc12
: