Target
Estrogen receptor beta
Ligand
BDBM50123208
Substrate
Meas. Tech.
ChEBML_67193
IC50
5.9±n/a nM
Citation
 Blizzard, TAMorgan, JDMosley, RTBirzin, ETFrisch, KRohrer, SPHammond, ML 2-Phenylspiroindenes: a novel class of selective estrogen receptor modulators (SERMs). Bioorg Med Chem Lett 13:479-83 (2003)  
Target
Name:
Estrogen receptor beta
Synonyms:
ER-beta ESR2_HUMAN Estradiol receptor beta (ERβ) Estrogen receptor (ER beta) Estrogen receptor beta (ER beta) NR3A2 estrogen beta
Type:
Protein
Mol. Mass.:
59238.43
Organism:
Homo sapiens (Human)
Description:
Q92731
Residue:
530
  
Inhibitor
Name:
BDBM50123208
Synonyms:
2-(4-hydroxyphenyl)-3-methyl-1,2'-spirobi[1H-indene]-5-ol | CHEMBL145576
Type:
Small organic molecule
Emp. Form.:
C24H20O2
Mol. Mass.:
340.4144
SMILES:
CC1=C(c2ccc(O)cc2)C2(Cc3ccccc3C2)c2ccc(O)cc12
: