Target
C-C chemokine receptor type 5
Ligand
BDBM50123442
Substrate
Meas. Tech.
ChEMBL_39648 (CHEMBL649953)
Ki
10±n/a nM
Citation
 McCombie, SWTagat, JRVice, SFLin, SISteensma, RPalani, ANeustadt, BRBaroudy, BMStrizki, JMEndres, MCox, KDan, NChou, CC Piperazine-based CCR5 antagonists as HIV-1 inhibitors. III: synthesis, antiviral and pharmacokinetic profiles of symmetrical heteroaryl carboxamides. Bioorg Med Chem Lett 13:567-71 (2003)  
Target
Name:
C-C chemokine receptor type 5
Synonyms:
C-C CKR-5 CC-CKR-5 CCR5 CCR5_HUMAN CHEMR13 HIV-1 fusion coreceptor
Type:
Enzyme
Mol. Mass.:
40540.21
Organism:
Homo sapiens (Human)
Description:
P51681
Residue:
352
  
Inhibitor
Name:
BDBM50123442
Synonyms:
(4-Methyl-4-{(S)-3-methyl-4-[(S)-1-(4-trifluoromethyl-phenyl)-ethyl]-piperazin-1-yl}-piperidin-1-yl)-(2,4,6-trimethyl-pyrimidin-5-yl)-methanone | CHEMBL342137
Type:
Small organic molecule
Emp. Form.:
C28H38F3N5O
Mol. Mass.:
517.6294
SMILES:
C[C@H](N1CCN(C[C@@H]1C)C1(C)CCN(CC1)C(=O)c1c(C)nc(C)nc1C)c1ccc(cc1)C(F)(F)F
: