Target
Protein disulfide-isomerase
Ligand
BDBM50561111
Substrate
Meas. Tech.
ChEMBL_2074276 (CHEMBL4729810)
IC50
<200±n/a nM
Citation
 Shergalis, AXue, DGharbia, FZDriks, HShrestha, BTanweer, ACromer, KLjungman, MNeamati, N Characterization of Aminobenzylphenols as Protein Disulfide Isomerase Inhibitors in Glioblastoma Cell Lines. J Med Chem 63:10263-10286 (2020)  
Target
Name:
Protein disulfide-isomerase
Synonyms:
Cellular thyroid hormone-binding protein P4HB PDIA1 PO4DB | Protein Disulfide-Isomerase (PDI)
Type:
Protein
Mol. Mass.:
57084.91
Organism:
Homo sapiens (Human)
Description:
P07237
Residue:
508
  
Inhibitor
Name:
BDBM50561111
Synonyms:
CHEMBL4751839
Type:
Small organic molecule
Emp. Form.:
C20H24N2O3
Mol. Mass.:
340.4162
SMILES:
CN(C)c1ccc(cc1)C(N1CCCC1)c1cc2OCOc2cc1O
: