Target
Protein disulfide-isomerase
Ligand
BDBM50561153
Substrate
Meas. Tech.
ChEMBL_2074276 (CHEMBL4729810)
IC50
290±n/a nM
Citation
 Shergalis, AXue, DGharbia, FZDriks, HShrestha, BTanweer, ACromer, KLjungman, MNeamati, N Characterization of Aminobenzylphenols as Protein Disulfide Isomerase Inhibitors in Glioblastoma Cell Lines. J Med Chem 63:10263-10286 (2020)  
Target
Name:
Protein disulfide-isomerase
Synonyms:
Cellular thyroid hormone-binding protein P4HB PDIA1 PO4DB | Protein Disulfide-Isomerase (PDI)
Type:
Protein
Mol. Mass.:
57084.91
Organism:
Homo sapiens (Human)
Description:
P07237
Residue:
508
  
Inhibitor
Name:
BDBM50561153
Synonyms:
CHEMBL4782811
Type:
Small organic molecule
Emp. Form.:
C20H22FNO3
Mol. Mass.:
343.392
SMILES:
Oc1c(ccc2OCCOc12)C(N1CCCCC1)c1ccc(F)cc1
: