Target
Delta-type opioid receptor
Ligand
BDBM50123999
Substrate
Meas. Tech.
ChEMBL_147150 (CHEMBL758175)
Ki
61±n/a nM
Citation
 Wentland, MPYe, YCioffi, CLLou, RZhou, QXu, GDuan, WDehnhardt, CMSun, XCohen, DJBidlack, JM Syntheses and opioid receptor binding affinities of 8-amino-2,6-methano-3-benzazocines. J Med Chem 46:838-49 (2003)  
Target
Name:
Delta-type opioid receptor
Synonyms:
D-OR-1 Delta opioid receptor OPIATE Delta OPRD1 OPRK1 | opioid receptor, delta 1
Type:
G Protein-Coupled Receptor (GPCR)
Mol. Mass.:
40382.98
Organism:
Homo sapiens (Human)
Description:
Competition binding assays were carried out using membrane preparations from transfected HN9.10 cells that constitutively expressed the delta opioid receptor.
Residue:
372
  
Inhibitor
Name:
BDBM50123999
Synonyms:
(4-tert-Butyl-phenyl)-(3-cyclopropylmethyl-6,11-dimethyl-1,2,3,4,5,6-hexahydro-2,6-methano-benzo[d]azocin-8-yl)-amine | CHEMBL352827
Type:
Small organic molecule
Emp. Form.:
C28H38N2
Mol. Mass.:
402.6147
SMILES:
C[C@H]1C2Cc3ccc(Nc4ccc(cc4)C(C)(C)C)cc3[C@@]1(C)CCN2CC1CC1
: