Target
Peroxisome proliferator-activated receptor alpha
Ligand
BDBM50124388
Substrate
Meas. Tech.
ChEBML_153549
Ki
53±n/a nM
Citation
 Adams, ADYuen, WHu, ZSantini, CJones, ABMacNaul, KLBerger, JPDoebber, TWMoller, DE Amphipathic 3-phenyl-7-propylbenzisoxazoles; human pPaR gamma, delta and alpha agonists. Bioorg Med Chem Lett 13:931-5 (2003)  
Target
Name:
Peroxisome proliferator-activated receptor alpha
Synonyms:
NR1C1 PPAR PPAR-alpha PPARA_HUMAN Peroxisome proliferator-activated receptor | Peroxisome proliferator-activated receptor alpha (PPAR alpha)
Type:
Enzyme
Mol. Mass.:
52222.08
Organism:
Homo sapiens (Human)
Description:
Q07869
Residue:
468
  
Inhibitor
Name:
BDBM50124388
Synonyms:
3-{3-[3-(3-Phenyl-7-propyl-benzo[d]isoxazol-6-yloxy)-propoxy]-phenyl}-propionic acid | CHEMBL368793
Type:
Small organic molecule
Emp. Form.:
C28H29NO5
Mol. Mass.:
459.5336
SMILES:
CCCc1c(OCCCOc2cccc(CCC(O)=O)c2)ccc2c(noc12)-c1ccccc1
: