Target
Endothelin-1 receptor
Ligand
BDBM50124496
Substrate
Meas. Tech.
ChEBML_65486
IC50
0.400000±n/a nM
Citation
 Bolli, MHBoss, CClozel, MFischli, WHess, PWeller, T The use of sulfonylamido pyrimidines incorporating an unsaturated side chain as endothelin receptor antagonists. Bioorg Med Chem Lett 13:955-9 (2003)  
Target
Name:
Endothelin-1 receptor
Synonyms:
EDNRA ET-A ETA-R Endothelin receptor type A hET-AR
Type:
Enzyme Catalytic Domain
Mol. Mass.:
48736.88
Organism:
Homo sapiens (Human)
Description:
P25101
Residue:
427
  
Inhibitor
Name:
BDBM50124496
Synonyms:
CHEMBL368996 | Pyrazin-2-yl-carbamic acid 4-[6-(5-isopropyl-pyridine-2-sulfonylamino)-5-(2-methoxy-phenoxy)-2-morpholin-4-yl-pyrimidin-4-yloxy]-but-2-ynyl ester
Type:
Small organic molecule
Emp. Form.:
C32H34N8O8S
Mol. Mass.:
690.726
SMILES:
COc1ccccc1Oc1c(NS(=O)(=O)c2ccc(cn2)C(C)C)nc(nc1OCC#CCOC(=O)Nc1cnccn1)N1CCOCC1
: