Target
Glutamate receptor ionotropic, NMDA 2A
Ligand
BDBM50124907
Substrate
Meas. Tech.
ChEBML_141035
IC50
>10000±n/a nM
Citation
 Claiborne, CFMcCauley, JALibby, BECurtis, NRDiggle, HJKulagowski, JJMichelson, SRAnderson, KDClaremon, DAFreidinger, RMBednar, RAMosser, SDGaul, SLConnolly, TMCondra, CLBednar, BStump, GLLynch, JJMacaulay, AWafford, KAKoblan, KSLiverton, NJ Orally efficacious NR2B-selective NMDA receptor antagonists. Bioorg Med Chem Lett 13:697-700 (2003)  
Target
Name:
Glutamate receptor ionotropic, NMDA 2A
Synonyms:
GRIN2A Glutamate [NMDA] receptor Glutamate [NMDA] receptor subunit epsilon-1 NMDA receptor subtype 2A protein (NR2A) NMDE1_HUMAN hNR2A
Type:
Mol. Mass.:
165293.76
Organism:
Homo sapiens (Human)
Description:
Residue:
1464
  
Inhibitor
Name:
BDBM50124907
Synonyms:
4-trifluoromethoxy-N-(2-trifluoromethyl-benzyl)-benzamidine | CHEMBL159279
Type:
Small organic molecule
Emp. Form.:
C16H12F6N2O
Mol. Mass.:
362.2697
SMILES:
NC(=NCc1ccccc1C(F)(F)F)c1ccc(OC(F)(F)F)cc1
: