Target
Coagulation factor X
Ligand
BDBM50124984
Substrate
Meas. Tech.
ChEMBL_48972 (CHEMBL663502)
IC50
0.500000±n/a nM
Citation
 Huang, WNaughton, MAYang, HSu, TDam, SWong, PWArfsten, AEdwards, SSinha, UHollenbach, SScarborough, RMZhu, BY Design, synthesis, and structure-activity relationships of unsubstituted piperazinone-based transition state factor Xa inhibitors. Bioorg Med Chem Lett 13:723-8 (2003)  
Target
Name:
Coagulation factor X
Synonyms:
Activated coagulation factor X (FXa) Coagulation factor X precursor F10 Factor X heavy chain Factor Xa Stuart-Prower factor
Type:
Enzyme
Mol. Mass.:
54726.60
Organism:
Homo sapiens (Human)
Description:
Residue:
488
  
Inhibitor
Name:
BDBM50124984
Synonyms:
(R)-5-Guanidino-2-phenylmethanesulfonylamino-pentanoic acid {[(R)-4-guanidino-1-(thiazole-2-carbonyl)-butylcarbamoyl]-methyl}-amide | CHEMBL352039
Type:
Small organic molecule
Emp. Form.:
C24H36N10O5S2
Mol. Mass.:
608.737
SMILES:
NC(=N)NCCC[C@@H](NS(=O)(=O)Cc1ccccc1)C(=O)NCC(=O)N[C@H](CCCNC(N)=N)C(=O)c1nccs1
: