Target
72 kDa type IV collagenase
Ligand
BDBM50072566
Substrate
Meas. Tech.
ChEMBL_2077158 (CHEMBL4732949)
IC50
1.1±n/a nM
Citation
 Kumari, SCarmona, AVTiwari, AKTrippier, PC Amide Bond Bioisosteres: Strategies, Synthesis, and Successes. J Med Chem 63:12290-12358 (2020)  
Target
Name:
72 kDa type IV collagenase
Synonyms:
72 kDa gelatinase CLG4A Gelatinase A (MMP-2) MMP2_HUMAN Matrix metalloproteinase-2 (MMP 2) Matrix metalloproteinases 2 (MMP-2) | TBE-1
Type:
Enzyme
Mol. Mass.:
73870.36
Organism:
Homo sapiens (Human)
Description:
P08253
Residue:
660
  
Inhibitor
Name:
BDBM50072566
Synonyms:
(2R,3S)-2-Allyl-N*4*-[(S)-1-benzyl-2-(1H-indol-3-yl)-2-oxo-ethyl]-N*1*-hydroxy-3-isobutyl-succinamide | CHEMBL432991
Type:
Small organic molecule
Emp. Form.:
C28H33N3O4
Mol. Mass.:
475.5793
SMILES:
CC(C)C[C@H]([C@H](CC=C)C(=O)NO)C(=O)N[C@@H](Cc1ccccc1)C(=O)c1c[nH]c2ccccc12
: