Target
Beta-3 adrenergic receptor
Ligand
BDBM50126070
Substrate
Meas. Tech.
ChEBML_39070
EC50
96±n/a nM
Citation
 Harada, HHirokawa, YSuzuki, KHiyama, YOue, MKawashima, HYoshida, NFurutani, YKato, S Novel and potent human and rat beta3-adrenergic receptor agonists containing substituted 3-indolylalkylamines. Bioorg Med Chem Lett 13:1301-5 (2003)  
Target
Name:
Beta-3 adrenergic receptor
Synonyms:
ADRB3 ADRB3_HUMAN Beta-2 adrenergic receptor and beta-3 adrenergic receptor Beta-3 adrenoreceptor | adrenergic Beta3
Type:
G Protein-Coupled Receptor (GPCR)
Mol. Mass.:
43534.88
Organism:
Homo sapiens (Human)
Description:
Residue:
408
  
Inhibitor
Name:
BDBM50126070
Synonyms:
1-(3-Chloro-phenyl)-2-[1-methyl-2-(4-methyl-1H-indol-3-yl)-ethylamino]-ethanol | CHEMBL24269
Type:
Small organic molecule
Emp. Form.:
C20H23ClN2O
Mol. Mass.:
342.862
SMILES:
CC(Cc1c[nH]c2cccc(C)c12)NCC(O)c1cccc(Cl)c1
: