Target
cGMP-specific 3',5'-cyclic phosphodiesterase
Ligand
BDBM50126464
Substrate
Meas. Tech.
ChEBML_155207
IC50
2±n/a nM
Citation
 Maw, GNAllerton, CMGbekor, EMillion, WA Design, synthesis and biological activity of beta-carboline-based type-5 phosphodiesterase inhibitors. Bioorg Med Chem Lett 13:1425-8 (2003)  
Target
Name:
cGMP-specific 3',5'-cyclic phosphodiesterase
Synonyms:
3',5'-cyclic phosphodiesterase PDE5 PDE5A_HUMAN Phosphodiesterase 5 (PDE5) Phosphodiesterase 5A (PDE5A) cGMP-specific 3',5'-cyclic phosphodiesterase
Type:
Protein
Mol. Mass.:
99975.83
Organism:
Homo sapiens (Human)
Description:
O76074
Residue:
875
  
Inhibitor
Name:
BDBM50126464
Synonyms:
(6R,12aR)-6-Benzo[1,3]dioxol-5-yl-2-[(R)-1-(2-pyrazin-2-yl-ethyl)-pyrrolidin-3-yl]-2,3,6,7,12,12a-hexahydro-pyrazino[1',2':1,6]pyrido[3,4-b]indole-1,4-dione | CHEMBL33121
Type:
Small organic molecule
Emp. Form.:
C31H30N6O4
Mol. Mass.:
550.6077
SMILES:
O=C1CN([C@@H]2CCN(CCc3cnccn3)C2)C(=O)[C@H]2Cc3c([nH]c4ccccc34)[C@H](N12)c1ccc2OCOc2c1
: