Target
Dual 3',5'-cyclic-AMP and -GMP phosphodiesterase 11A
Ligand
BDBM50126463
Substrate
Meas. Tech.
ChEBML_156293
IC50
6.5±n/a nM
Citation
 Maw, GNAllerton, CMGbekor, EMillion, WA Design, synthesis and biological activity of beta-carboline-based type-5 phosphodiesterase inhibitors. Bioorg Med Chem Lett 13:1425-8 (2003)  
Target
Name:
Dual 3',5'-cyclic-AMP and -GMP phosphodiesterase 11A
Synonyms:
Dual 3',5'-cyclic-AMP and -GMP phosphodiesterase 11A PDE11_HUMAN Phosphodiesterase 11A Phosphodiesterase 11A4 | cAMP and cGMP phosphodiesterase 11A
Type:
Enzyme
Mol. Mass.:
104751.53
Organism:
Homo sapiens (Human)
Description:
Q9HCR9
Residue:
933
  
Inhibitor
Name:
BDBM50126463
Synonyms:
(6R,12aR)-2-((R)-1-Benzyl-pyrrolidin-3-yl)-6-p-tolyl-2,3,6,7,12,12a-hexahydro-pyrazino[1',2':1,6]pyrido[3,4-b]indole-1,4-dione | CHEMBL34744
Type:
Small organic molecule
Emp. Form.:
C32H32N4O2
Mol. Mass.:
504.6221
SMILES:
Cc1ccc(cc1)[C@H]1N2[C@H](Cc3c1[nH]c1ccccc31)C(=O)N(CC2=O)[C@@H]1CCN(Cc2ccccc2)C1
: