Target
cGMP-specific 3',5'-cyclic phosphodiesterase
Ligand
BDBM50126451
Substrate
Meas. Tech.
ChEBML_155207
IC50
2.7±n/a nM
Citation
 Maw, GNAllerton, CMGbekor, EMillion, WA Design, synthesis and biological activity of beta-carboline-based type-5 phosphodiesterase inhibitors. Bioorg Med Chem Lett 13:1425-8 (2003)  
Target
Name:
cGMP-specific 3',5'-cyclic phosphodiesterase
Synonyms:
3',5'-cyclic phosphodiesterase PDE5 PDE5A_HUMAN Phosphodiesterase 5 (PDE5) Phosphodiesterase 5A (PDE5A) cGMP-specific 3',5'-cyclic phosphodiesterase
Type:
Protein
Mol. Mass.:
99975.83
Organism:
Homo sapiens (Human)
Description:
O76074
Residue:
875
  
Inhibitor
Name:
BDBM50126451
Synonyms:
(6R,12aR)-2-((R)-1-Benzyl-pyrrolidin-3-yl)-6-(4-methoxy-phenyl)-2,3,6,7,12,12a-hexahydro-pyrazino[1',2':1,6]pyrido[3,4-b]indole-1,4-dione | CHEMBL34276
Type:
Small organic molecule
Emp. Form.:
C32H32N4O3
Mol. Mass.:
520.6215
SMILES:
COc1ccc(cc1)[C@H]1N2[C@H](Cc3c1[nH]c1ccccc31)C(=O)N(CC2=O)[C@@H]1CCN(Cc2ccccc2)C1
: