Target
cGMP-specific 3',5'-cyclic phosphodiesterase
Ligand
BDBM50126470
Substrate
Meas. Tech.
ChEBML_155207
IC50
8.4±n/a nM
Citation
 Maw, GNAllerton, CMGbekor, EMillion, WA Design, synthesis and biological activity of beta-carboline-based type-5 phosphodiesterase inhibitors. Bioorg Med Chem Lett 13:1425-8 (2003)  
Target
Name:
cGMP-specific 3',5'-cyclic phosphodiesterase
Synonyms:
3',5'-cyclic phosphodiesterase PDE5 PDE5A_HUMAN Phosphodiesterase 5 (PDE5) Phosphodiesterase 5A (PDE5A) cGMP-specific 3',5'-cyclic phosphodiesterase
Type:
Protein
Mol. Mass.:
99975.83
Organism:
Homo sapiens (Human)
Description:
O76074
Residue:
875
  
Inhibitor
Name:
BDBM50126470
Synonyms:
3-[(R)-3-((6R,12aR)-6-Benzo[1,3]dioxol-5-yl-1,4-dioxo-3,4,6,7,12,12a-hexahydro-1H-pyrazino[1',2':1,6]pyrido[3,4-b]indol-2-yl)-pyrrolidin-1-yl]-propionamide | CHEMBL33147
Type:
Small organic molecule
Emp. Form.:
C28H29N5O5
Mol. Mass.:
515.5604
SMILES:
NC(=O)CCN1CC[C@H](C1)N1CC(=O)N2[C@H](Cc3c([nH]c4ccccc34)[C@H]2c2ccc3OCOc3c2)C1=O
: