Target
Nischarin
Ligand
BDBM50127600
Substrate
Meas. Tech.
ChEMBL_220592 (CHEMBL841871)
Ki
10±n/a nM
Citation
 Touzeau, FArrault, AGuillaumet, GScalbert, EPfeiffer, BRettori, MCRenard, PMérour, JY Synthesis and biological evaluation of new 2-(4,5-dihydro-1H-imidazol-2-yl)-3,4-dihydro-2H-1,4-benzoxazine derivatives. J Med Chem 46:1962-79 (2003)  
Target
Name:
Nischarin
Synonyms:
IRAS Imidazoline receptor 1 (I1R) NISCH Nischarin
Type:
Enzyme
Mol. Mass.:
166571.31
Organism:
Homo sapiens (Human)
Description:
Q9Y2I1
Residue:
1504
  
Inhibitor
Name:
BDBM50127600
Synonyms:
2-(4,5-Dihydro-1H-imidazol-2-yl)-2,3,5,6-tetrahydro-4H-1-oxa-3a-aza-phenalene | CHEMBL274784
Type:
Small organic molecule
Emp. Form.:
C14H17N3O
Mol. Mass.:
243.3043
SMILES:
C1CN=C(N1)C1CN2CCCc3cccc(O1)c23
: