Target
Homeodomain-interacting protein kinase 3
Ligand
BDBM50563538
Substrate
Meas. Tech.
ChEMBL_2083233 (CHEMBL4739024)
IC50
125±n/a nM
Citation
 N?mec, VMaier, LBerger, BTChaikuad, ADrápela, SSou?ek, KKnapp, SParuch, K Highly selective inhibitors of protein kinases CLK and HIPK with the furo[3,2-b]pyridine core. Eur J Med Chem 215:0 (2021)  
Target
Name:
Homeodomain-interacting protein kinase 3
Synonyms:
DYRK6 HIPK3 PKY
Type:
PROTEIN
Mol. Mass.:
133763.81
Organism:
Homo sapiens (Human)
Description:
ChEMBL_774503
Residue:
1215
  
Inhibitor
Name:
BDBM50563538
Synonyms:
CHEMBL4797457
Type:
Small organic molecule
Emp. Form.:
C21H17N5O
Mol. Mass.:
355.3926
SMILES:
Cn1cc(cn1)-c1cccc(c1)-c1coc2ccc(nc12)-c1cnn(C)c1
: