Target
Homeodomain-interacting protein kinase 3
Ligand
BDBM50563554
Substrate
Meas. Tech.
ChEMBL_2083233 (CHEMBL4739024)
IC50
128±n/a nM
Citation
 N?mec, VMaier, LBerger, BTChaikuad, ADrápela, SSou?ek, KKnapp, SParuch, K Highly selective inhibitors of protein kinases CLK and HIPK with the furo[3,2-b]pyridine core. Eur J Med Chem 215:0 (2021)  
Target
Name:
Homeodomain-interacting protein kinase 3
Synonyms:
DYRK6 HIPK3 PKY
Type:
PROTEIN
Mol. Mass.:
133763.81
Organism:
Homo sapiens (Human)
Description:
ChEMBL_774503
Residue:
1215
  
Inhibitor
Name:
BDBM50563554
Synonyms:
CHEMBL4790030
Type:
Small organic molecule
Emp. Form.:
C16H11N3O
Mol. Mass.:
261.278
SMILES:
c1n[nH]cc1-c1ccc2occ(-c3ccccc3)c2n1
: