Target
Homeodomain-interacting protein kinase 3
Ligand
BDBM50563555
Substrate
Meas. Tech.
ChEMBL_2083233 (CHEMBL4739024)
IC50
38±n/a nM
Citation
 N?mec, VMaier, LBerger, BTChaikuad, ADrápela, SSou?ek, KKnapp, SParuch, K Highly selective inhibitors of protein kinases CLK and HIPK with the furo[3,2-b]pyridine core. Eur J Med Chem 215:0 (2021)  
Target
Name:
Homeodomain-interacting protein kinase 3
Synonyms:
DYRK6 HIPK3 PKY
Type:
PROTEIN
Mol. Mass.:
133763.81
Organism:
Homo sapiens (Human)
Description:
ChEMBL_774503
Residue:
1215
  
Inhibitor
Name:
BDBM50563555
Synonyms:
CHEMBL4750420
Type:
Small organic molecule
Emp. Form.:
C20H13N3O
Mol. Mass.:
311.3367
SMILES:
c1n[nH]cc1-c1ccc2occ(-c3ccc4ccccc4c3)c2n1
: