Target
Homeodomain-interacting protein kinase 3
Ligand
BDBM50563546
Substrate
Meas. Tech.
ChEMBL_2083233 (CHEMBL4739024)
IC50
>3000±n/a nM
Citation
 N?mec, VMaier, LBerger, BTChaikuad, ADrápela, SSou?ek, KKnapp, SParuch, K Highly selective inhibitors of protein kinases CLK and HIPK with the furo[3,2-b]pyridine core. Eur J Med Chem 215:0 (2021)  
Target
Name:
Homeodomain-interacting protein kinase 3
Synonyms:
DYRK6 HIPK3 PKY
Type:
PROTEIN
Mol. Mass.:
133763.81
Organism:
Homo sapiens (Human)
Description:
ChEMBL_774503
Residue:
1215
  
Inhibitor
Name:
BDBM50563546
Synonyms:
CHEMBL4758047
Type:
Small organic molecule
Emp. Form.:
C26H25N3O
Mol. Mass.:
395.4962
SMILES:
C1C2CC3CC1CC(C2)(C3)c1ccc(cc1)-c1coc2ccc(nc12)-c1cn[nH]c1
: