Target
Homeodomain-interacting protein kinase 3
Ligand
BDBM50563548
Substrate
Meas. Tech.
ChEMBL_2083233 (CHEMBL4739024)
IC50
>3000±n/a nM
Citation
 N?mec, VMaier, LBerger, BTChaikuad, ADrápela, SSou?ek, KKnapp, SParuch, K Highly selective inhibitors of protein kinases CLK and HIPK with the furo[3,2-b]pyridine core. Eur J Med Chem 215:0 (2021)  
Target
Name:
Homeodomain-interacting protein kinase 3
Synonyms:
DYRK6 HIPK3 PKY
Type:
PROTEIN
Mol. Mass.:
133763.81
Organism:
Homo sapiens (Human)
Description:
ChEMBL_774503
Residue:
1215
  
Inhibitor
Name:
BDBM50563548
Synonyms:
CHEMBL4790254
Type:
Small organic molecule
Emp. Form.:
C20H20N4O
Mol. Mass.:
332.399
SMILES:
Cn1cc(nn1)-c1ccc2occ(-c3ccc(cc3)C(C)(C)C)c2n1
: