Target
Proto-oncogene tyrosine-protein kinase receptor Ret
Ligand
BDBM21
Substrate
Meas. Tech.
ChEMBL_2085410 (CHEMBL4766673)
IC50
9.0±n/a nM
Citation
 Yang, JChen, KZhang, GYang, QYLi, YSHuang, SZWang, YLYang, WJiang, XJYan, HXZhu, JQXiang, RLuo, YFLi, WMWei, YQLi, LLYang, SY Structural optimization and structure-activity relationship studies of N-phenyl-7,8-dihydro-6H-pyrimido[5,4-b][1,4]oxazin-4-amine derivatives as a new class of inhibitors of RET and its drug resistance mutants. Eur J Med Chem 143:1148-1164 (2018)  
Target
Name:
Proto-oncogene tyrosine-protein kinase receptor Ret
Synonyms:
CDHF12 Cadherin family member 12 Proto-oncogene c-Ret RET51 Tyrosine-protein kinase Ret (RET)
Type:
Protein
Mol. Mass.:
124318.29
Organism:
Homo sapiens (Human)
Description:
P07949
Residue:
1114
  
Inhibitor
Name:
BDBM21
Synonyms:
CHEMBL24828 VANDETANIB ZD6474 | cid_3081361
Type:
Emp. Form.:
C22H24BrFN4O2
Mol. Mass.:
475.354
SMILES:
COc1cc2c(Nc3ccc(Br)cc3F)ncnc2cc1OCC1CCN(C)CC1
: