Target
Tyrosine-protein kinase Blk
Ligand
BDBM50357312
Substrate
Meas. Tech.
ChEMBL_2088707 (CHEMBL4769970)
IC50
1.1±n/a nM
Citation
 Teng, YLu, XXiao, MLi, ZZou, YRen, SCheng, YLuo, GXiang, H Discovery of potent and highly selective covalent inhibitors of Bruton's tyrosine kinase bearing triazine scaffold. Eur J Med Chem 199:0 (2020)  
Target
Name:
Tyrosine-protein kinase Blk
Synonyms:
B lymphoid tyrosine kinase BLK_HUMAN Tyrosine-protein kinase BLK (BLK) | p55-Blk
Type:
Protein
Mol. Mass.:
57711.88
Organism:
Homo sapiens (Human)
Description:
P51451
Residue:
505
  
Inhibitor
Name:
BDBM50357312
Synonyms:
IBRUTINIB US10124003, Ref. Ex. Compound 1 US10793575, Example ibrutinib US10919899, Ibrutinib US11186578, Example Ibrutinib US11407754, Example Ibrutinib US20240059694, Compound Ibrutinib US9181263, 1 | US9278100, 1
Type:
Small organic molecule
Emp. Form.:
C25H24N6O2
Mol. Mass.:
440.4971
SMILES:
Nc1ncnc2n(nc(-c3ccc(Oc4ccccc4)cc3)c12)[C@@H]1CCCN(C1)C(=O)C=C
: