Target
Bone morphogenetic protein 1
Ligand
BDBM50129221
Substrate
Meas. Tech.
ChEBML_158890
Ki
18±n/a nM
Citation
 Delaet, NGRobinson, LAWilson, DMSullivan, RWBradley, EKDankwardt, SMMartin, RLVan Wart, HEWalker, KA Novel inhibitors of procollagen C-terminal proteinase. Part 1: diamino Acid hydroxamates. Bioorg Med Chem Lett 13:2101-4 (2003)  
Target
Name:
Bone morphogenetic protein 1
Synonyms:
BMP-1 BMP1_HUMAN PCOLC Procollagen C-proteinase | mTld
Type:
PROTEIN
Mol. Mass.:
111254.03
Organism:
Homo sapiens (Human)
Description:
ChEMBL_518962
Residue:
986
  
Inhibitor
Name:
BDBM50129221
Synonyms:
2-[Benzo[1,3]dioxol-5-ylmethyl-((R)-4-methoxy-benzenesulfonyl)-amino]-N-hydroxy-3-[3-{4-chloro-phenyl-sulfonyl}-urea-1-yl]-propionamide | CHEMBL67907
Type:
Small organic molecule
Emp. Form.:
C25H25ClN4O10S2
Mol. Mass.:
641.07
SMILES:
COc1ccc(cc1)S(=O)(=O)N(Cc1ccc2OCOc2c1)[C@H](CNC(=O)NS(=O)(=O)c1ccc(Cl)cc1)C(=O)NO
: